BDBM50437411 CHEMBL2409022
SMILES CCOCc1c(cnn1-c1ncc(C)c(n1)N1CCC1)C(=O)NCc1cncn1C
InChI Key InChIKey=UCJMMCUURXVVJG-UHFFFAOYSA-N
Data  1 EC50
  Tab Delimited (TSV)   2D SDfile   Computed 3D by Vconf -m prep SDfile
Find this compound or compounds like it in BindingDB:
Activity Spreadsheet -- Enzyme Inhibition Constant Data from BindingDB
Found 1 hit for monomerid = 50437411
TargetProbable G-protein coupled receptor 142(Homo sapiens (Human))
Daiichi Sankyo
Curated by ChEMBL
LigandPNGBDBM50437411(CHEMBL2409022)
Affinity DataEC50:  28nM. Assay description: Agonist activity at human GPR142 transfected in HEK293 cells after 1 hr by inositol phosphate accumulation assay
In DepthDetails ArticlePubMed