BDBM50437445 CHEMBL2409322
SMILES O[C@H]1CN2CCC[C@H](O)[C@@H]12
InChI Key InChIKey=OHWYUBJIJMGVMR-ACZMJKKPSA-N
Data  1 IC50
  Tab Delimited (TSV)   2D SDfile   Computed 3D by Vconf -m prep SDfile
Find this compound or compounds like it in BindingDB:
Activity Spreadsheet -- Enzyme Inhibition Constant Data from BindingDB
Found 1 hit for monomerid = 50437445
TargetAlpha-glucosidase(Aspergillus niger)
University Of Oxford
Curated by ChEMBL
LigandPNGBDBM50437445(CHEMBL2409322)
Affinity DataIC50:  3.07E+5nM. Assay description: Inhibition of Aspergillus niger alpha-glucosidase
In DepthDetails ArticlePubMed