BDBM50437474 CHEMBL2409472
SMILES O=C(C1CC1)[C@@H]1C[C@H]2CNC[C@H](C2)C1
InChI Key InChIKey=BRRKZDRFDMYVGP-UHFFFAOYSA-N
Data  1 KI  1 EC50
  Tab Delimited (TSV)   2D SDfile   Computed 3D by Vconf -m prep SDfile
Find this compound or compounds like it in BindingDB:
Activity Spreadsheet -- Enzyme Inhibition Constant Data from BindingDB
Found 2 hits for monomerid = 50437474
TargetNeuronal acetylcholine receptor subunit alpha-4/beta-2(Homo sapiens (Human))
Targacept
Curated by ChEMBL
LigandPNGBDBM50437474(CHEMBL2409472)
Affinity DataKi:  43nM. Assay description: Displacement of [3H]Nicotine from alpha4beta2 nACHR in human SHEP1 cell membranes after 2 hrs by liquid scintillation counting analysis
In DepthDetails ArticlePubMed
TargetNeuronal acetylcholine receptor subunit alpha-4/beta-2(Homo sapiens (Human))
Targacept
Curated by ChEMBL
LigandPNGBDBM50437474(CHEMBL2409472)
Affinity DataEC50:  7.10E+3nM. Assay description: Agonist activity at alpha4beta2 nACHR in human SHEP1 cell membranes assessed as stimulation of calcium flux by FLIPR assay
In DepthDetails ArticlePubMed