BDBM50437942 CHEMBL1814396
SMILES CCOC1Oc2ccccc2C(=O)C1=CNc1cccc(c1)S(N)(=O)=O
InChI Key InChIKey=PCLVYHGTWPWKOS-UHFFFAOYSA-N
Data  2 KI
  Tab Delimited (TSV)   2D SDfile   Computed 3D by Vconf -m prep SDfile
Find this compound or compounds like it in BindingDB:
Activity Spreadsheet -- Enzyme Inhibition Constant Data from BindingDB
Found 2 hits for monomerid = 50437942
TargetIntestinal-type alkaline phosphatase(Bos taurus (Cattle))
Forman Christian College (A Chartered University)
Curated by ChEMBL
LigandPNGBDBM50437942(CHEMBL1814396)
Affinity DataKi:  3.35E+4nM. Assay description: Inhibition of bovine intestinal alkaline phosphatase using p-NPP as substrate treated 10 mins before substrate addition measured after 30 mins by spe...
In DepthDetails ArticlePubMed
TargetAlkaline phosphatase, tissue-nonspecific isozyme(Bos taurus (Cattle))
Forman Christian College (A Chartered University)
Curated by ChEMBL
LigandPNGBDBM50437942(CHEMBL1814396)
Affinity DataKi:  4.10E+4nM. Assay description: Inhibition of bovine kidney intestinal alkaline phosphatase using p-NPP as substrate treated 10 mins before substrate addition measured after 30 mins...
In DepthDetails ArticlePubMed