BDBM50438194 CHEMBL2407796
SMILES COc1cccc(c1)-c1cc2c(cnc(N)c2o1)-c1cnn(c1)C1CCN(CC1)C(C)=O
InChI Key InChIKey=JGGNOFDCJIHVTK-UHFFFAOYSA-N
Data  2 IC50
  Tab Delimited (TSV)   2D SDfile   Computed 3D by Vconf -m prep SDfile
Find this compound or compounds like it in BindingDB:
Activity Spreadsheet -- Enzyme Inhibition Constant Data from BindingDB
Found 2 hits for monomerid = 50438194
TargetMitogen-activated protein kinase kinase kinase 7(Homo sapiens (Human))
Osi Pharmaceuticals
Curated by ChEMBL
LigandPNGBDBM50438194(CHEMBL2407796)
Affinity DataIC50:  1.20E+3nM. Assay description: Inhibition of TAK1 in human HCT116 cells assessed as inhibition of TNF-alpha-stimulated JNK phosphorylation
In DepthDetails ArticlePubMed
LigandPNGBDBM50438194(CHEMBL2407796)
Affinity DataIC50:  1.80E+3nM. Assay description: Inhibition of truncated TAK1-TAB1(unknown origin) using MKK7 as substrate by ALPHAScreen assay in presence of ATP
In DepthDetails ArticlePubMed