BDBM50438217 CHEMBL2407763
SMILES CC(=O)N1CCC(CC1)n1cc(cn1)-c1cnc(N)c2oc(cc12)-c1csc2ccccc12
InChI Key InChIKey=PPDQFCISGDOHIO-UHFFFAOYSA-N
Data  2 IC50
  Tab Delimited (TSV)   2D SDfile   Computed 3D by Vconf -m prep SDfile
Find this compound or compounds like it in BindingDB:
Activity Spreadsheet -- Enzyme Inhibition Constant Data from BindingDB
Found 2 hits for monomerid = 50438217
LigandPNGBDBM50438217(CHEMBL2407763)
Affinity DataIC50:  340nM. Assay description: Inhibition of truncated TAK1-TAB1(unknown origin) using MKK7 as substrate by ALPHAScreen assay in presence of ATP
In DepthDetails ArticlePubMed
TargetMitogen-activated protein kinase kinase kinase 7(Homo sapiens (Human))
Osi Pharmaceuticals
Curated by ChEMBL
LigandPNGBDBM50438217(CHEMBL2407763)
Affinity DataIC50:  440nM. Assay description: Inhibition of TAK1 in human HCT116 cells assessed as inhibition of TNF-alpha-stimulated JNK phosphorylation
In DepthDetails ArticlePubMed