BDBM50438245 CHEMBL2408001
SMILES Clc1ccc(cc1)C1=CCN(Cc2ccc3OCC(=O)Nc3c2)CC1
InChI Key InChIKey=DILADYSWTPWOGH-UHFFFAOYSA-N
Data  1 Kd
  Tab Delimited (TSV)   2D SDfile   Computed 3D by Vconf -m prep SDfile
Find this compound or compounds like it in BindingDB:
Activity Spreadsheet -- Enzyme Inhibition Constant Data from BindingDB
Found 1 hit for monomerid = 50438245
TargetPoly [ADP-ribose] polymerase 1(Homo sapiens (Human))
Takeda California
Curated by ChEMBL
LigandPNGBDBM50438245(CHEMBL2408001)
Affinity DataKd:  15nM. Assay description: Binding affinity to catalytic domain of human PARP1 after 5 mins by surface plasmon resonance assay
In DepthDetails ArticlePubMed