BDBM50438274 CHEMBL2408382
SMILES Cc1ccc2c(c1)n(cc(C(O)=O)c2=O)[C@@H]1O[C@H](CO)[C@@H](O)[C@H]1O
InChI Key InChIKey=ORHMVTHJIPEHLL-NMFUWQPSSA-N
Data  1 KI
  Tab Delimited (TSV)   2D SDfile   Computed 3D by Vconf -m prep SDfile
Find this compound or compounds like it in BindingDB:
Activity Spreadsheet -- Enzyme Inhibition Constant Data from BindingDB
Found 1 hit for monomerid = 50438274
TargetGlyceraldehyde-3-phosphate dehydrogenase, glycosomal(Trypanosoma cruzi)
Da Universidade De S£O Paulo
Curated by ChEMBL
LigandPNGBDBM50438274(CHEMBL2408382)
Affinity DataKi:  1.71E+4nM. Assay description: Competitive inhibition of Trypanosoma cruzi glycosomal GAPDH NAD+ binding site by ITC method
In DepthDetails ArticlePubMed