BDBM50438290 CHEMBL2408573
SMILES CC1CC(=O)c2cnc(Nc3ccc(Cl)cn3)nc2C1
InChI Key InChIKey=YNJOXUKTRWRWHJ-UHFFFAOYSA-N
Data  1 IC50
  Tab Delimited (TSV)   2D SDfile   Computed 3D by Vconf -m prep SDfile
Find this compound or compounds like it in BindingDB:
Activity Spreadsheet -- Enzyme Inhibition Constant Data from BindingDB
Found 1 hit for monomerid = 50438290
TargetMetabotropic glutamate receptor 5(Homo sapiens (Human))
Merz Pharmaceuticals
Curated by ChEMBL
LigandPNGBDBM50438290(CHEMBL2408573)
Affinity DataIC50:  721nM. Assay description: Negative allosteric modulation of human mGluR5 expressed in CHO cells assessed as inhibition of L-quisqualate-induced intracellular cAMP accumulation...
In DepthDetails ArticlePubMed