BDBM50438309 CHEMBL2408582
SMILES Cc1cccc(Nc2ncc3C(=O)CCCc3n2)c1
InChI Key InChIKey=DYSMSOZGDSBFGJ-UHFFFAOYSA-N
Data  2 IC50
  Tab Delimited (TSV)   2D SDfile   Computed 3D by Vconf -m prep SDfile
Find this compound or compounds like it in BindingDB:
Activity Spreadsheet -- Enzyme Inhibition Constant Data from BindingDB
Found 2 hits for monomerid = 50438309
TargetMetabotropic glutamate receptor 1(Homo sapiens (Human))
Merz Pharmaceuticals
Curated by ChEMBL
LigandPNGBDBM50438309(CHEMBL2408582)
Affinity DataIC50: >1.00E+5nM. Assay description: Negative allosteric modulation of human mGluR1 expressed in CHO cells assessed as inhibition of L-glutamate-induced intracellular cAMP accumulation t...
In DepthDetails ArticlePubMed
TargetMetabotropic glutamate receptor 5(Homo sapiens (Human))
Merz Pharmaceuticals
Curated by ChEMBL
LigandPNGBDBM50438309(CHEMBL2408582)
Affinity DataIC50:  496nM. Assay description: Negative allosteric modulation of human mGluR5 expressed in CHO cells assessed as inhibition of L-quisqualate-induced intracellular cAMP accumulation...
In DepthDetails ArticlePubMed