BDBM50438327 CHEMBL2408723
SMILES Nc1ncc(-c2ccsc2)c2cc(oc12)-c1csc2cnccc12
InChI Key InChIKey=HASWSCWRIWXJMP-UHFFFAOYSA-N
Data  1 IC50
  Tab Delimited (TSV)   2D SDfile   Computed 3D by Vconf -m prep SDfile
Find this compound or compounds like it in BindingDB:
Activity Spreadsheet -- Enzyme Inhibition Constant Data from BindingDB
Found 1 hit for monomerid = 50438327
LigandPNGBDBM50438327(CHEMBL2408723)
Affinity DataIC50:  2.20E+3nM. Assay description: Inhibition of TAK1-TAB1 (unknown origin) by alphascreen assay in presence of ATP
In DepthDetails ArticlePubMed