BDBM50438524 CHEMBL2414852
SMILES CN(C)c1ccc(cc1)C1NC(=S)N2CCCCN12
InChI Key InChIKey=DQYAYHVJTSBCMZ-UHFFFAOYSA-N
Data  1 IC50
  Tab Delimited (TSV)   2D SDfile   Computed 3D by Vconf -m prep SDfile
Find this compound or compounds like it in BindingDB:
Activity Spreadsheet -- Enzyme Inhibition Constant Data from BindingDB
Found 1 hit for monomerid = 50438524
TargetNitric oxide synthase, inducible(Rattus norvegicus)
Ernst-Moritz-Arndt University Greifswald
Curated by ChEMBL
LigandPNGBDBM50438524(CHEMBL2414852)
Affinity DataIC50:  1.01E+5nM. Assay description: Inhibition of iNOS-mediated NO production in IL-1beta/IFNgamma-stimulated rat RINmF cells by Griess reaction
In DepthDetails ArticlePubMed