BDBM50438526 CHEMBL2414841
SMILES Clc1ccccc1C1NC(=S)N2CCCCN12
InChI Key InChIKey=ONQDNJZVYVBJKN-UHFFFAOYSA-N
Data  1 IC50
  Tab Delimited (TSV)   2D SDfile   Computed 3D by Vconf -m prep SDfile
Find this compound or compounds like it in BindingDB:
Activity Spreadsheet -- Enzyme Inhibition Constant Data from BindingDB
Found 1 hit for monomerid = 50438526
TargetNitric oxide synthase, inducible(Rattus norvegicus)
Ernst-Moritz-Arndt University Greifswald
Curated by ChEMBL
LigandPNGBDBM50438526(CHEMBL2414841)
Affinity DataIC50:  6.30E+4nM. Assay description: Inhibition of iNOS-mediated NO production in IL-1beta/IFNgamma-stimulated rat RINmF cells by Griess reaction
In DepthDetails ArticlePubMed