BDBM50438536 CHEMBL2414862
SMILES CC(=NNC(=O)Nc1ccncc1)c1ccc(O)cc1
InChI Key InChIKey=KODLYXQOPZUKPJ-UHFFFAOYSA-N
Data  2 KI  2 IC50
  Tab Delimited (TSV)   2D SDfile   Computed 3D by Vconf -m prep SDfile
Find this compound or compounds like it in BindingDB:
Activity Spreadsheet -- Enzyme Inhibition Constant Data from BindingDB
Found 4 hits for monomerid = 50438536
TargetAcetylcholinesterase(Electrophorus electricus (Electric eel))
Banaras Hindu University
Curated by ChEMBL
LigandPNGBDBM50438536(CHEMBL2414862)
Affinity DataKi:  246nM. Assay description: Non competitive inhibition of electric eel AChE using acetylthiocholine iodide as substrate by Lineweaver-Burk plot analysis
In DepthDetails ArticlePubMed
TargetCholinesterase(Homo sapiens (Human))
Banaras Hindu University
Curated by ChEMBL
LigandPNGBDBM50438536(CHEMBL2414862)
Affinity DataKi:  628nM. Assay description: Competitive inhibition of human serum BChE using butyrylthiocholine iodide as substrate by Lineweaver-Burk plot analysis
In DepthDetails ArticlePubMed
TargetCholinesterase(Homo sapiens (Human))
Banaras Hindu University
Curated by ChEMBL
LigandPNGBDBM50438536(CHEMBL2414862)
Affinity DataIC50:  358nM. Assay description: Inhibition of human serum BChE using butyrylthiocholine iodide as substrate preincubated for 20 mins prior to substrate addition by Ellman's method
In DepthDetails ArticlePubMed
TargetAcetylcholinesterase(Electrophorus electricus (Electric eel))
Banaras Hindu University
Curated by ChEMBL
LigandPNGBDBM50438536(CHEMBL2414862)
Affinity DataIC50:  148nM. Assay description: Inhibition of electric eel AChE using acetylthiocholine iodide as substrate preincubated for 20 mins prior to substrate addition by Ellman's method
In DepthDetails ArticlePubMed