BDBM50438652 CHEMBL2414453
SMILES Ic1ccc(OCCCn2cncn2)cc1
InChI Key InChIKey=SCCIDSYLKBREGC-UHFFFAOYSA-N
Data  2 IC50
  Tab Delimited (TSV)   2D SDfile   Computed 3D by Vconf -m prep SDfile
Find this compound or compounds like it in BindingDB:
Activity Spreadsheet -- Enzyme Inhibition Constant Data from BindingDB
Found 2 hits for monomerid = 50438652
TargetHeme oxygenase 1(Rattus norvegicus (rat))
University Of Catania
Curated by ChEMBL
LigandPNGBDBM50438652(CHEMBL2414453)
Affinity DataIC50:  7.50E+4nM. Assay description: Inhibition of Sprague-Dawley rat spleen microsomal HO-1 assessed as bilirubin formation after 60 mins by spectrophotometric analysis
In DepthDetails ArticlePubMed
TargetHeme oxygenase 2(Rattus norvegicus (rat))
University Of Catania
Curated by ChEMBL
LigandPNGBDBM50438652(CHEMBL2414453)
Affinity DataIC50:  9.00E+4nM. Assay description: Inhibition of Sprague-Dawley rat brain HO-2 assessed as bilirubin formation after 60 mins by spectrophotometric analysis
In DepthDetails ArticlePubMed