BDBM50438754 CHEMBL2414880
SMILES OC[C@@H]1[C@@H](O)[C@H](O)[C@@H](O)CN1CCCCNC(=O)CC1c2ccccc2-c2ccccc12
InChI Key InChIKey=SSALNGJMPHAYKJ-PEISPCAHSA-N
Data  1 KI
  Tab Delimited (TSV)   2D SDfile   Computed 3D by Vconf -m prep SDfile
Find this compound or compounds like it in BindingDB:
Activity Spreadsheet -- Enzyme Inhibition Constant Data from BindingDB
Found 1 hit for monomerid = 50438754
TargetLysosomal acid glucosylceramidase(Homo sapiens (Human))
Genomics Research Center
Curated by ChEMBL
LigandPNGBDBM50438754(CHEMBL2414880)
Affinity DataKi:  400nM. Assay description: Competitive inhibition of human beta-glucocerebrosidase by Lineweaver-Burk double reciprocal plot method
In DepthDetails ArticlePubMed