BDBM50438818 CHEMBL2413371
SMILES CN(Cc1ccc(F)cc1)C(=O)Cc1c(C)c(c2ccccn12)S(=O)(=O)Cc1ccccc1
InChI Key InChIKey=WRCXZPLRTFNYDG-UHFFFAOYSA-N
Data  2 IC50
  Tab Delimited (TSV)   2D SDfile   Computed 3D by Vconf -m prep SDfile
Find this compound or compounds like it in BindingDB:
Activity Spreadsheet -- Enzyme Inhibition Constant Data from BindingDB
Found 2 hits for monomerid = 50438818
TargetOrexin/Hypocretin receptor type 1(Homo sapiens (Human))
Janssen Pharmaceutica
Curated by ChEMBL
LigandPNGBDBM50438818(CHEMBL2413371)
Affinity DataIC50:  2.38E+3nM. Assay description: Antagonist activity at human orexin receptor 1 expressed in CHO cells assessed as inhibition of orexin-A-induced calcium flux by FLIPR assay
In DepthDetails ArticlePubMed
TargetOrexin receptor type 2(Homo sapiens (Human))
Janssen Pharmaceutica
Curated by ChEMBL
LigandPNGBDBM50438818(CHEMBL2413371)
Affinity DataIC50:  0.800nM. Assay description: Antagonist activity at human orexin receptor 2 expressed in CHO cells assessed as inhibition of orexin-A-induced calcium flux by FLIPR assay
In DepthDetails ArticlePubMed