BDBM50439225 CHEMBL2418825
SMILES Cc1ccc(Nc2nc(cs2)C(=O)N2CCCCC2c2ccccc2)cc1
InChI Key InChIKey=LTQSYWKOQNDTCH-UHFFFAOYSA-N
Data  2 IC50
  Tab Delimited (TSV)   2D SDfile   Computed 3D by Vconf -m prep SDfile
Find this compound or compounds like it in BindingDB:
Activity Spreadsheet -- Enzyme Inhibition Constant Data from BindingDB
Found 2 hits for monomerid = 50439225
TargetShort transient receptor potential channel 3(Homo sapiens (Human))
Glaxosmithkline
Curated by ChEMBL
LigandPNGBDBM50439225(CHEMBL2418825)
Affinity DataIC50:  1.26E+4nM. Assay description: Inhibition of human recombinant TRPC3 expressed in HEK293-MSRII cells assessed as carbachol-stimulated Ca2+/Na+ influx after 10 mins by FLIPR assay
In DepthDetails ArticlePubMed
TargetShort transient receptor potential channel 6(Homo sapiens (Human))
Glaxosmithkline
Curated by ChEMBL
LigandPNGBDBM50439225(CHEMBL2418825)
Affinity DataIC50:  1.58E+4nM. Assay description: Inhibition of human recombinant TRPC6 expressed in HEK293-MSRII cells assessed as carbachol-stimulated Ca2+/Na+ influx after 10 mins by FLIPR assay
In DepthDetails ArticlePubMed