BDBM50439304 CHEMBL2419505
SMILES O=C(NCc1ccc(cc1)S(=O)(=O)c1ccccc1)N1Cc2ccncc2C1
InChI Key InChIKey=BGECQVFGWHCTBJ-UHFFFAOYSA-N
Data  8 IC50
  Tab Delimited (TSV)   2D SDfile   Computed 3D by Vconf -m prep SDfile
Find this compound or compounds like it in BindingDB:
Activity Spreadsheet -- Enzyme Inhibition Constant Data from BindingDB
Found 8 hits for monomerid = 50439304
TargetCytochrome P450 2C9(Homo sapiens (Human))
Genentech
Curated by ChEMBL
LigandPNGBDBM50439304(CHEMBL2419505)
Affinity DataIC50:  54nM. Assay description: Inhibition of CYP2C9 in human liver microsomes using (S)- warfarin as substrate by LC-MS/MS analysis
In DepthDetails ArticlePubMed
TargetCytochrome P450 2C19(Homo sapiens (Human))
Genentech
Curated by ChEMBL
LigandPNGBDBM50439304(CHEMBL2419505)
Affinity DataIC50:  3.70E+3nM. Assay description: Inhibition of CYP2C19 in human liver microsomes using (S)-mephenytoin as substrate by LC-MS/MS analysis
In DepthDetails ArticlePubMed
TargetNicotinamide phosphoribosyltransferase(Homo sapiens (Human))
Genentech
Curated by ChEMBL
LigandPNGBDBM50439304(CHEMBL2419505)
Affinity DataIC50:  14nM. Assay description: Inhibition of human NAMPT using NAM/PRPP as substrate incubated for 15 mins prior to substrate addition measured after 30 mins by mass spectrometric ...
In DepthDetails ArticlePubMed
TargetNicotinamide phosphoribosyltransferase(Homo sapiens (Human))
Genentech
Curated by ChEMBL
LigandPNGBDBM50439304(CHEMBL2419505)
Affinity DataIC50:  15nM. Assay description: Inhibition of NAMPT in human A2780 cells assessed as decrease in cell viability after 72 hrs by SRB assay
In DepthDetails ArticlePubMed
TargetCytochrome P450 2D6(Homo sapiens (Human))
Genentech
Curated by ChEMBL
LigandPNGBDBM50439304(CHEMBL2419505)
Affinity DataIC50:  5.00E+3nM. Assay description: Inhibition of CYP2D6 in human liver microsomes using dextromethorphan as substrate by LC-MS/MS analysis
In DepthDetails ArticlePubMed
TargetCytochrome P450 2C9(Homo sapiens (Human))
Genentech
Curated by ChEMBL
LigandPNGBDBM50439304(CHEMBL2419505)
Affinity DataIC50:  50nM. Assay description: Reversible inhibition of CYP2C9 in human liver microsomes using (S)-warfarin as substrate in presence of NADPH by LC-MS/MS analysis
In DepthDetails ArticlePubMed
TargetNicotinamide phosphoribosyltransferase(Homo sapiens (Human))
Genentech
Curated by ChEMBL
LigandPNGBDBM50439304(CHEMBL2419505)
Affinity DataIC50:  14nM. Assay description: Inhibition of human full length C-terminal His6-tagged NAMPT expressed in Escherichia coli Rosetta (DE3) cells using nicotinamide as substrate incuba...
In DepthDetails ArticlePubMed
TargetCytochrome P450 1A2(Homo sapiens (Human))
Genentech
Curated by ChEMBL
LigandPNGBDBM50439304(CHEMBL2419505)
Affinity DataIC50: >1.00E+4nM. Assay description: Inhibition of CYP1A2 in human liver microsomes using phenacetin as substrate by LC-MS/MS analysis
In DepthDetails ArticlePubMed