BDBM50439330 CHEMBL2419541
SMILES CSCC[C@H](NC(=O)[C@H](Cc1ccccc1)NC(=O)CNC(=O)[C@@H](C)NC(=O)[C@@H](N)Cc1ccc(O)cc1)C(=O)N[C@@H](Cc1c[nH]c2ccccc12)C(=O)OCc1cc(cc(c1)C(F)(F)F)C(F)(F)F
InChI Key InChIKey=MJOXRJQZLVVZCL-DZGOFYRVSA-N
Data  2 KI
  Tab Delimited (TSV)   2D SDfile   Computed 3D by Vconf -m prep SDfile
Find this compound or compounds like it in BindingDB:
Activity Spreadsheet -- Enzyme Inhibition Constant Data from BindingDB
Found 2 hits for monomerid = 50439330
TargetSubstance-P receptor(Homo sapiens (Human))
University Of Arizona
Curated by ChEMBL
LigandPNGBDBM50439330(CHEMBL2419541)
Affinity DataKi:  0.0900nM. Assay description: Displacement of [3H]substance P from human NK1 receptor expressed in CHO cells
In DepthDetails ArticlePubMed
TargetSubstance-P receptor(Rattus norvegicus (rat))
University Of Arizona
Curated by ChEMBL
LigandPNGBDBM50439330(CHEMBL2419541)
Affinity DataKi:  0.290nM. Assay description: Displacement of [3H]substance P from rat NK1 receptor expressed in CHO cells
In DepthDetails ArticlePubMed