BDBM50439427 CHEMBL2420565
SMILES CCC[C@@H](NC(=O)c1ccc2nc(N[C@H]3CC[C@H](O)CC3)c3nccn3c2c1)c1ccccc1
InChI Key InChIKey=ZLEVCWSCDUVECC-YPAWHYETSA-N
Data  1 IC50
  Tab Delimited (TSV)   2D SDfile   Computed 3D by Vconf -m prep SDfile
Find this compound or compounds like it in BindingDB:
Activity Spreadsheet -- Enzyme Inhibition Constant Data from BindingDB
Found 1 hit for monomerid = 50439427
TargetMicrotubule-associated serine/threonine-protein kinase 3(Homo sapiens (Human))
Activx Biosciences
Curated by ChEMBL
LigandPNGBDBM50439427(CHEMBL2420565)
Affinity DataIC50:  2.40E+3nM. Assay description: Inhibition of MAST3 in human HuH7 cell lysates
In DepthDetails ArticlePubMed