BDBM50439451 CHEMBL2420890
SMILES CCOc1ccccc1N1CCN(Cc2csc3ccccc23)CC1
InChI Key InChIKey=IQRVICMQFUJBJE-UHFFFAOYSA-N
Data  1 KI
  Tab Delimited (TSV)   2D SDfile   Computed 3D by Vconf -m prep SDfile
Find this compound or compounds like it in BindingDB:
Activity Spreadsheet -- Enzyme Inhibition Constant Data from BindingDB
Found 1 hit for monomerid = 50439451
TargetD(2) dopamine receptor(Homo sapiens (Human))
German University In Cairo
Curated by ChEMBL
LigandPNGBDBM50439451(CHEMBL2420890)
Affinity DataKi:  219nM. Assay description: Displacement of [3H]spiperone from human dopamine D2 receptor
In DepthDetails ArticlePubMed