BDBM50439651 CHEMBL2419808
SMILES CC(CCCCc1ccccc1)OC(=O)N[C@@H]1[C@H](C)OC1=O
InChI Key InChIKey=KGYJJKDSVCTGHM-RGPPAHDHSA-N
Data  3 IC50
  Tab Delimited (TSV)   2D SDfile   Computed 3D by Vconf -m prep SDfile
Find this compound or compounds like it in BindingDB:
Activity Spreadsheet -- Enzyme Inhibition Constant Data from BindingDB
Found 3 hits for monomerid = 50439651
TargetN-acylethanolamine-hydrolyzing acid amidase(Rattus norvegicus (Rat))
Istituto Italiano Di Tecnologia
Curated by ChEMBL
LigandPNGBDBM50439651(CHEMBL2419808)
Affinity DataIC50:  18nM. Assay description: Inhibition of Sprague Dawley rat lung native NAAA enzyme using heptadecenoylethanolamide as substrate preincubated for 30 mins followed by substrate ...
In DepthDetails ArticlePubMed
TargetN-acylethanolamine-hydrolyzing acid amidase(Rattus norvegicus (Rat))
Istituto Italiano Di Tecnologia
Curated by ChEMBL
LigandPNGBDBM50439651(CHEMBL2419808)
Affinity DataIC50:  5.10E+3nM. Assay description: Inhibition of Sprague Dawley rat lung native NAAA enzyme using heptadecenoylethanolamide as substrate preincubated for 30 mins followed by substrate ...
In DepthDetails ArticlePubMed
TargetN-acylethanolamine-hydrolyzing acid amidase(Rattus norvegicus (Rat))
Istituto Italiano Di Tecnologia
Curated by ChEMBL
LigandPNGBDBM50439651(CHEMBL2419808)
Affinity DataIC50:  5.10E+3nM. Assay description: Inhibition of Sprague Dawley rat lung native NAAA enzyme using heptadecenoylethanolamide as substrate preincubated for 30 mins followed by substrate ...
In DepthDetails ArticlePubMed