BDBM50439812 CHEMBL2419711
SMILES O=C(CCc1ccccc1)N(Cc1cccs1)Cc1nc2ccccc2c(=O)[nH]1
InChI Key InChIKey=SKYFUELJMZKOQQ-UHFFFAOYSA-N
Data  2 IC50
PDB links: 1 PDB ID matches this monomer.
  Tab Delimited (TSV)   2D SDfile   Computed 3D by Vconf -m prep SDfile
Find this compound or compounds like it in BindingDB:
Activity Spreadsheet -- Enzyme Inhibition Constant Data from BindingDB
Found 2 hits for monomerid = 50439812
TargetPoly [ADP-ribose] polymerase 1(Homo sapiens (Human))
Novartis Institutes For Biomedical Research
Curated by ChEMBL
LigandPNGBDBM50439812(CHEMBL2419711)
Affinity DataIC50:  1.82E+4nM. Assay description: Inhibition of PARP1 (unknown origin) assessed as nicotinamide concentration by LC-MS analysis
In DepthDetails ArticlePubMed
TargetProtein Wnt-3a(Homo sapiens (Human))
Novartis Institutes For Biomedical Research
Curated by ChEMBL
LigandPNGBDBM50439812(CHEMBL2419711)
Affinity DataIC50:  937nM. Assay description: Inhibition of WNT3A signaling in HEK293 cells by luciferase reporter gene assay in presence of forskolin
In DepthDetails ArticlePubMed