BDBM50440008 CHEMBL2425402
SMILES CC(C)C[C@H](N)C(=O)N[C@@H]([C@@H](C)O)C(=O)N[C@@H](CC(C)C)C(=O)NCC(=O)N1CCC[C@H]1C(=O)N[C@@H](CC(C)C)C(=O)N[C@@H](CC(C)C)C(O)=O
InChI Key InChIKey=JCBKGBLPBJUMPV-OTALQBMTSA-N
Data  1 IC50
  Tab Delimited (TSV)   2D SDfile   Computed 3D by Vconf -m prep SDfile
Find this compound or compounds like it in BindingDB:
Activity Spreadsheet -- Enzyme Inhibition Constant Data from BindingDB
Found 1 hit for monomerid = 50440008
TargetIsocitrate lyase(Mycobacterium tuberculosis)TBA
LigandPNGBDBM50440008(CHEMBL2425402)
Affinity DataIC50:  2.08E+5nM. Assay description: Inhibition of Mycobacterium tuberculosis recombinant isocitrate lyase expressed in Escherichia coli BL21 (DE3) using isocitrate as substrate after 10...
In DepthDetails Article