BDBM50440012 CHEMBL2425398
SMILES CSCC[C@H](NC(=O)[C@@H](N)[C@@H](C)O)C(=O)N[C@@H](Cc1cnc[nH]1)C(=O)N[C@@H](CC(C)C)C(=O)N[C@@H](CO)C(=O)N1CCC[C@H]1C(=O)N[C@@H](Cc1ccc(O)cc1)C(O)=O
InChI Key InChIKey=HIFRLGDCEFMVFP-JRRSVIDUSA-N
Data  1 IC50
  Tab Delimited (TSV)   2D SDfile   Computed 3D by Vconf -m prep SDfile
Find this compound or compounds like it in BindingDB:
Activity Spreadsheet -- Enzyme Inhibition Constant Data from BindingDB
Found 1 hit for monomerid = 50440012
TargetIsocitrate lyase(Mycobacterium tuberculosis)TBA
LigandPNGBDBM50440012(CHEMBL2425398)
Affinity DataIC50:  1.56E+5nM. Assay description: Inhibition of Mycobacterium tuberculosis recombinant isocitrate lyase expressed in Escherichia coli BL21 (DE3) using isocitrate as substrate after 10...
In DepthDetails Article