BDBM50440013 CHEMBL2425397
SMILES [#6]-[#6](-[#6])-[#6@H](-[#7]-[#6](=O)-[#6@H](-[#6]-[#6]-[#6]\[#7]=[#6](/[#7])-[#7])-[#7]-[#6](=O)-[#6@H](-[#6])-[#7]-[#6](=O)-[#6@@H](-[#7])-[#6]-[#8])-[#6](=O)-[#7]-[#6@@H](-[#6@@H](-[#6])-[#8])-[#6](=O)-[#7]-[#6@@H](-[#6]-[#8])-[#6](=O)-[#7]-[#6@@H](-[#6]-[#6]-[#6]\[#7]=[#6](/[#7])-[#7])-[#6](-[#8])=O
InChI Key InChIKey=XZGPZDLQMHQVFS-YRQPXTNQSA-N
Data  1 IC50
  Tab Delimited (TSV)   2D SDfile   Computed 3D by Vconf -m prep SDfile
Find this compound or compounds like it in BindingDB:
Activity Spreadsheet -- Enzyme Inhibition Constant Data from BindingDB
Found 1 hit for monomerid = 50440013
TargetIsocitrate lyase(Mycobacterium tuberculosis)TBA
LigandPNGBDBM50440013(CHEMBL2425397)
Affinity DataIC50:  1.66E+5nM. Assay description: Inhibition of Mycobacterium tuberculosis recombinant isocitrate lyase expressed in Escherichia coli BL21 (DE3) using isocitrate as substrate after 10...
In DepthDetails Article