BDBM50440167 CHEMBL2426576
SMILES Cc1ccc(cc1)-c1nc(CSc2nc(N)cc(N)n2)cs1
InChI Key InChIKey=QDWMJRODVOVBIC-UHFFFAOYSA-N
Data  1 IC50
  Tab Delimited (TSV)   2D SDfile   Computed 3D by Vconf -m prep SDfile
Find this compound or compounds like it in BindingDB:
Activity Spreadsheet -- Enzyme Inhibition Constant Data from BindingDB
Found 1 hit for monomerid = 50440167
TargetDeoxycytidine kinase(Mus musculus)
California Nanosystems Institute
Curated by ChEMBL
LigandPNGBDBM50440167(CHEMBL2426576)
Affinity DataIC50:  2.32E+3nM. Assay description: Inhibition of dCK in mouse L1210 cells assessed as inhibition of tritiated deoxycytidine [3H]-dC uptake
In DepthDetails ArticlePubMed