BDBM50440231 CHEMBL2426638
SMILES CC(C)CC(c1ccc2n(ncc2c1)-c1ccc(F)cc1)C(C)(C)C(=O)Nc1nncs1
InChI Key InChIKey=VFKDEFSJOCZLKQ-UHFFFAOYSA-N
Data  1 KI  1 EC50
  Tab Delimited (TSV)   2D SDfile   Computed 3D by Vconf -m prep SDfile
Find this compound or compounds like it in BindingDB:
Activity Spreadsheet -- Enzyme Inhibition Constant Data from BindingDB
Found 2 hits for monomerid = 50440231
TargetGlucocorticoid receptor(Homo sapiens (Human))
Ironwood Pharmaceuticals
Curated by ChEMBL
LigandPNGBDBM50440231(CHEMBL2426638)
Affinity DataKi:  7.5nM. Assay description: Binding affinity to glucocorticoid receptor (unknown origin) by fluorescence polarization assay
In DepthDetails ArticlePubMed
TargetGlucocorticoid receptor(Homo sapiens (Human))
Ironwood Pharmaceuticals
Curated by ChEMBL
LigandPNGBDBM50440231(CHEMBL2426638)
Affinity DataEC50:  29nM. Assay description: Agonist activity at glucocorticoid receptor in human A549 cells assessed as inhibition of PMA-induced AP-1 activation by luciferase reporter gene ass...
In DepthDetails ArticlePubMed