BDBM50440257 CHEMBL2426669
SMILES COc1ccc(CC(=O)N2CCC3(CN(C3)[C@@H](C)c3ccc(cc3)-c3ncccn3)CC2)nc1
InChI Key InChIKey=OBWXZZBFWOHLCS-FQEVSTJZSA-N
Data  2 KI
  Tab Delimited (TSV)   2D SDfile   Computed 3D by Vconf -m prep SDfile
Find this compound or compounds like it in BindingDB:
Activity Spreadsheet -- Enzyme Inhibition Constant Data from BindingDB
Found 2 hits for monomerid = 50440257
TargetGrowth hormone secretagogue receptor type 1(Homo sapiens (Human))
Pfizer
Curated by ChEMBL
LigandPNGBDBM50440257(CHEMBL2426669)
Affinity DataKi:  1.12E+3nM. Assay description: Displacement of [125I]-ghrelin from human GHS-R1a expressed in tetracycline inducible HEK293 cells after 8 hrs by liquid scintillation counting
In DepthDetails ArticlePubMed
TargetMuscarinic acetylcholine receptor M2(Homo sapiens (Human))
Pfizer
Curated by ChEMBL
LigandPNGBDBM50440257(CHEMBL2426669)
Affinity DataKi:  2.24E+3nM. Assay description: Displacement of N-methyl [3H]-scopolamine from recombinant human muscarinic acetylcholine receptor M2 expressed in CHO cells after 2 hrs by liquid sc...
In DepthDetails ArticlePubMed