BDBM50440509 CHEMBL2426179
SMILES Clc1ccc(NC(=O)Nc2cccc(n2)-c2ccncc2)cc1Cl
InChI Key InChIKey=IQVIVUCZIJXEDE-UHFFFAOYSA-N
Data  1 IC50
  Tab Delimited (TSV)   2D SDfile   Computed 3D by Vconf -m prep SDfile
Find this compound or compounds like it in BindingDB:
Activity Spreadsheet -- Enzyme Inhibition Constant Data from BindingDB
Found 1 hit for monomerid = 50440509
TargetRecQ-like DNA helicase BLM(Homo sapiens (Human))
National Center For Advancing Translational Sciences
Curated by ChEMBL
LigandPNGBDBM50440509(CHEMBL2426179)
Affinity DataIC50:  4.00E+3nM. Assay description: Inhibition of BLM (unknown origin) by gel-based DNA unwinding assayChecked by Author
In DepthDetails ArticlePubMed