BDBM50440558 CHEMBL2426336
SMILES COc1cccc2C(CCCc12)N[C@@H]1CC[C@](C1)(C(C)C)C(=O)NCc1cc(cc(c1)C(F)(F)F)C(F)(F)F
InChI Key InChIKey=HGIIMDRTEYJJSV-XIAQZKNVSA-N
Data  1 KI
  Tab Delimited (TSV)   2D SDfile   Computed 3D by Vconf -m prep SDfile
Find this compound or compounds like it in BindingDB:
Activity Spreadsheet -- Enzyme Inhibition Constant Data from BindingDB
Found 1 hit for monomerid = 50440558
TargetC-C motif chemokine 2(Homo sapiens (Human))
Leiden University
Curated by ChEMBL
LigandPNGBDBM50440558(CHEMBL2426336)
Affinity DataKi:  27nM. Assay description: Displacement of [125I]-CCL2 from human CCR2 receptor expressed in human U2OS cell membranes
In DepthDetails ArticlePubMed