BDBM50440693 CHEMBL2430983
SMILES Cn1nc(cc1NC(=O)[C@H](Cc1ccccc1)NCC(O)=O)-c1ccncc1
InChI Key InChIKey=LWMQAANXGYCZIW-KRWDZBQOSA-N
Data  1 IC50  2 EC50
  Tab Delimited (TSV)   2D SDfile   Computed 3D by Vconf -m prep SDfile
Find this compound or compounds like it in BindingDB:
Activity Spreadsheet -- Enzyme Inhibition Constant Data from BindingDB
Found 3 hits for monomerid = 50440693
TargetProbable G-protein coupled receptor 142(Homo sapiens (Human))
Amgen
Curated by ChEMBL
LigandPNGBDBM50440693(CHEMBL2430983)
Affinity DataEC50:  52nM. Assay description: Agonist activity at human GPR142 expressed in HEK293 cells assessed as inositol phosphate accumulation using [3H]-inositol after 1 hr by scintillatio...
In DepthDetails ArticlePubMed
TargetProbable G-protein coupled receptor 142(Mus musculus)
Amgen
Curated by ChEMBL
LigandPNGBDBM50440693(CHEMBL2430983)
Affinity DataEC50:  31nM. Assay description: Agonist activity at mouse GPR142
In DepthDetails ArticlePubMed
TargetCytochrome P450 2D6(Homo sapiens (Human))
Amgen
Curated by ChEMBL
LigandPNGBDBM50440693(CHEMBL2430983)
Affinity DataIC50: >3.00E+4nM. Assay description: Inhibition of CYP2D6 (unknown origin)
In DepthDetails ArticlePubMed