BDBM50440873 CHEMBL2431723
SMILES [#6]-[#6]-[#6@H](-[#6])-[#6@H](-[#7]-[#6](=O)-[#6@H](-[#6]-c1ccc(cc1)-[#7+](-[#8-])=O)-[#7]-[#6](=O)-[#6@H](-[#6]-[#6]-[#6]\[#7]=[#6](/[#7])-[#7])-[#7]-[#6](=O)-[#6]-[#7]-[#6](=O)-[#6@@H](-[#7]-[#6](=O)-[#6@H](-[#6]-[#6](-[#6])-[#6])-[#7]-[#6](=O)-c1ccco1)-[#6@@H](-[#6])-[#6]-[#6])-[#6](-[#7])=O
InChI Key InChIKey=JMLUVXHKPBQLOM-DRMJLGPGSA-N
Data  1 EC50
  Tab Delimited (TSV)   2D SDfile   Computed 3D by Vconf -m prep SDfile
Find this compound or compounds like it in BindingDB:
Activity Spreadsheet -- Enzyme Inhibition Constant Data from BindingDB
Found 1 hit for monomerid = 50440873
TargetProteinase-activated receptor 2(Homo sapiens (Human))
The University Of Queensland
Curated by ChEMBL
LigandPNGBDBM50440873(CHEMBL2431723)
Affinity DataEC50:  200nM. Assay description: Agonist activity at PAR2 in human HT-29 cells assessed as increase in intracellular calcium release
In DepthDetails ArticlePubMed