BDBM50440886 CHEMBL2431818
SMILES Oc1ccc(Cc2nnc3ccc(nn23)-c2ccc(F)cc2)cc1
InChI Key InChIKey=OEDWCZQOHLVVLK-UHFFFAOYSA-N
Data  2 KI  2 IC50
  Tab Delimited (TSV)   2D SDfile   Computed 3D by Vconf -m prep SDfile
Find this compound or compounds like it in BindingDB:
Activity Spreadsheet -- Enzyme Inhibition Constant Data from BindingDB
Found 4 hits for monomerid = 50440886
TargetHepatocyte growth factor receptor(Homo sapiens (Human))
Vertex Pharmaceuticals
Curated by ChEMBL
LigandPNGBDBM50440886(CHEMBL2431818)
Affinity DataKi:  200nM. Assay description: Inhibition of c-Met (unknown origin) using poly Glu-Tyr as substrate preincubated for 10 mins followed by ATP addition by phosphoenolpyruvate/pyruvat...
In DepthDetails ArticlePubMed
TargetHepatocyte growth factor receptor(Homo sapiens (Human))
Vertex Pharmaceuticals
Curated by ChEMBL
LigandPNGBDBM50440886(CHEMBL2431818)
Affinity DataKi:  316nM. Assay description: Inhibition of N-terminal His-6-tagged human recombinant c-Met (974 to 1390) using Ac-ARDMYDKEYYSVHNK as substrate by spectrophotometric assay
In DepthDetails ArticlePubMed
TargetHepatocyte growth factor receptor(Homo sapiens (Human))
Vertex Pharmaceuticals
Curated by ChEMBL
LigandPNGBDBM50440886(CHEMBL2431818)
Affinity DataIC50:  380nM. Assay description: Inhibition of c-MET in human SNU-5 cells measured after 6 hrs by steady-glo luciferase reporter gene assay
In DepthDetails ArticlePubMed
TargetHepatocyte growth factor receptor(Homo sapiens (Human))
Vertex Pharmaceuticals
Curated by ChEMBL
LigandPNGBDBM50440886(CHEMBL2431818)
Affinity DataIC50:  1.31E+3nM. Assay description: Inhibition of c-Met autophosphorylation in human A549 cells after 1 hr by ELISA
In DepthDetails ArticlePubMed