BDBM50440969 CHEMBL2431963::US10196373, Compound SH3-079
SMILES Cc1ccc(cc1)S(=O)(=O)N(CC(=O)N(Cc1ccc(cc1)C1CCCCC1)c1ccc(C(O)=O)c(O)c1)Cc1ccccc1Cl
InChI Key InChIKey=FZDKOOHDWKRTIJ-UHFFFAOYSA-N
Data  1 KI  1 IC50
  Tab Delimited (TSV)   2D SDfile   Computed 3D by Vconf -m prep SDfile
Find this compound or compounds like it in BindingDB:
Activity Spreadsheet -- Enzyme Inhibition Constant Data from BindingDB
Found 2 hits for monomerid = 50440969
TargetSignal transducer and activator of transcription 3(Homo sapiens (Human))
The Governing Council Of The University Of Toronto
US Patent
LigandPNGBDBM50440969(CHEMBL2431963 | US10196373, Compound SH3-079)
Affinity DataKi:  7.90E+3nM. Assay description: ChIP assay was performed using EZ ChIP Kit (Millipore, Billerica, Mass., USA) as per manufacturer's instruction. Briefly, after crosslinking with...
In DepthDetails US Patent
TargetSignal transducer and activator of transcription 3(Homo sapiens (Human))
The Governing Council Of The University Of Toronto
US Patent
LigandPNGBDBM50440969(CHEMBL2431963 | US10196373, Compound SH3-079)
Affinity DataIC50:  1.58E+4nM. Assay description: Competitive binding affinity to Stat3 SH2 domain (unknown origin) using 5-FAM-GpYLPQTV-NH2 as probe assessed as phosphopetide complex formation after...
In DepthDetails ArticlePubMed