BDBM50441116 CHEMBL2430736
SMILES Nc1ncc(nc1NCc1ccccc1)-c1cccc(c1)C(O)=O
InChI Key InChIKey=BHODNZGDUOGUGS-UHFFFAOYSA-N
Data  2 IC50  1 Kd
  Tab Delimited (TSV)   2D SDfile   Computed 3D by Vconf -m prep SDfile
Find this compound or compounds like it in BindingDB:
Activity Spreadsheet -- Enzyme Inhibition Constant Data from BindingDB
Found 3 hits for monomerid = 50441116
TargetL-lactate dehydrogenase B chain(Homo sapiens (Human))
Genentech
Curated by ChEMBL
LigandPNGBDBM50441116(CHEMBL2430736)
Affinity DataIC50:  2.80E+4nM. Assay description: Inhibition of human recombinant carboxy-terminal his-tagged LDHB (1 to 333) expressed in Escherichia coli using pyruvate as substrate assessed as dis...
In DepthDetails ArticlePubMed
TargetL-lactate dehydrogenase A chain(Homo sapiens (Human))
Genentech
Curated by ChEMBL
LigandPNGBDBM50441116(CHEMBL2430736)
Affinity DataIC50:  1.20E+4nM. Assay description: Inhibition of human recombinant carboxy-terminal his-tagged LDHA (1 to 331) expressed in Escherichia coli using pyruvate as substrate assessed as dis...
In DepthDetails ArticlePubMed
TargetL-lactate dehydrogenase A chain(Homo sapiens (Human))
Genentech
Curated by ChEMBL
LigandPNGBDBM50441116(CHEMBL2430736)
Affinity DataKd:  2.20E+4nM. Assay description: Binding affinity to human recombinant carboxy-terminal his-tagged LDHA (1 to 331) expressed in Escherichia coli by surface plasmon resonance analysis...
In DepthDetails ArticlePubMed