BDBM50441163 CHEMBL2430878
SMILES COc1ccc-2c(c1)C(=N[C@@H](CC(=O)Nc1cccnc1)c1nnc(C)n-21)c1ccc(Cl)cc1
InChI Key InChIKey=FZHUYANULNIKTF-NRFANRHFSA-N
Data  1 IC50
  Tab Delimited (TSV)   2D SDfile   Computed 3D by Vconf -m prep SDfile
Find this compound or compounds like it in BindingDB:
Activity Spreadsheet -- Enzyme Inhibition Constant Data from BindingDB
Found 1 hit for monomerid = 50441163
TargetBromodomain-containing protein 4(Homo sapiens (Human))
Glaxosmithkline
Curated by ChEMBL
LigandPNGBDBM50441163(CHEMBL2430878)
Affinity DataIC50:  501nM. Assay description: Binding affinity to His6-tagged BRD4 (unknown origin) after 60 mins by fluorescence anisotropy binding Assay
In DepthDetails ArticlePubMed