BDBM50441445 CHEMBL2436270
SMILES C(N1CCCC1)c1nc2ccccc2n1C(c1ccccc1)c1ccccc1
InChI Key InChIKey=KVVFXIDTRQNBOT-UHFFFAOYSA-N
Data  2 IC50
  Tab Delimited (TSV)   2D SDfile   Computed 3D by Vconf -m prep SDfile
Find this compound or compounds like it in BindingDB:
Activity Spreadsheet -- Enzyme Inhibition Constant Data from BindingDB
Found 2 hits for monomerid = 50441445
TargetHeme oxygenase 1(Rattus norvegicus (rat))
Queen'S University
Curated by ChEMBL
LigandPNGBDBM50441445(CHEMBL2436270)
Affinity DataIC50: >1.00E+5nM. Assay description: Inhibition of HO-1 in Sprague-Dawley rat spleen microsomal fractions assessed as carbon monoxide formation from methemalbumin after 10 mins by gas ch...
In DepthDetails ArticlePubMed
TargetHeme oxygenase 2(Rattus norvegicus (rat))
Queen'S University
Curated by ChEMBL
LigandPNGBDBM50441445(CHEMBL2436270)
Affinity DataIC50:  4.10E+3nM. Assay description: Inhibition of HO-2 in Sprague-Dawley rat brain microsomal fractions assessed as carbon monoxide formation from methemalbumin after 10 mins by gas chr...
In DepthDetails ArticlePubMed