BDBM50441521 CHEMBL2436731
SMILES CN(c1cccc(c1)-c1cccc(O)c1)S(=O)(=O)c1ccc(F)c(O)c1
InChI Key InChIKey=IHWGKAPGEIXWAJ-UHFFFAOYSA-N
Data  2 IC50
  Tab Delimited (TSV)   2D SDfile   Computed 3D by Vconf -m prep SDfile
Find this compound or compounds like it in BindingDB:
Activity Spreadsheet -- Enzyme Inhibition Constant Data from BindingDB
Found 2 hits for monomerid = 50441521
Target17-beta-hydroxysteroid dehydrogenase type 2(Homo sapiens (Human))
Saarland University
Curated by ChEMBL
LigandPNGBDBM50441521(CHEMBL2436731)
Affinity DataIC50:  23nM. Assay description: Inhibition of human placenta 17beta-HSD2 microsomal fraction using unlabeled, [2,4,6,7-3H]-estradiol as substrate after 20 mins by HPLC analysis in p...
In DepthDetails ArticlePubMed
Target17-beta-hydroxysteroid dehydrogenase type 1(Homo sapiens (Human))
Saarland University
Curated by ChEMBL
LigandPNGBDBM50441521(CHEMBL2436731)
Affinity DataIC50:  238nM. Assay description: Inhibition of human placenta 17beta-HSD1 cytosolic fraction using unlabeled, [2,4,6,7-3H]-estrone as substrate after 20 mins by HPLC analysis in pres...
In DepthDetails ArticlePubMed