BDBM50441668 CHEMBL2435653
SMILES CC(C)(C)OC(=O)N1CCc2[nH]nc(c2C1)-c1ccccc1
InChI Key InChIKey=HNPQFQLLKKKALW-UHFFFAOYSA-N
Data  1 IC50
  Tab Delimited (TSV)   2D SDfile   Computed 3D by Vconf -m prep SDfile
Find this compound or compounds like it in BindingDB:
Activity Spreadsheet -- Enzyme Inhibition Constant Data from BindingDB
Found 1 hit for monomerid = 50441668
TargetPantothenate synthetase(Mycobacterium tuberculosis (strain ATCC 25618 / H3...)
Birla Institute Of Technology
Curated by ChEMBL
LigandPNGBDBM50441668(CHEMBL2435653)
Affinity DataIC50:  2.18E+4nM. Assay description: Inhibition of Mycobacterium tuberculosis pantothenate synthetase cloned in Escherichia coli BL21 (DE3) using ATP, beta-alanine, pantoic acid as subst...
In DepthDetails ArticlePubMed