BDBM50441891 CHEMBL2436889
SMILES Oc1cc2c(nc[nH]c2=O)c(O)c1O
InChI Key InChIKey=RNUPWQDKOJAKGW-UHFFFAOYSA-N
Data  2 KI
  Tab Delimited (TSV)   2D SDfile   Computed 3D by Vconf -m prep SDfile
Find this compound or compounds like it in BindingDB:
Activity Spreadsheet -- Enzyme Inhibition Constant Data from BindingDB
Found 2 hits for monomerid = 50441891
TargetInduced myeloid leukemia cell differentiation protein Mcl-1(Homo sapiens (Human))
Dalian University Of Technology
Curated by ChEMBL
LigandPNGBDBM50441891(CHEMBL2436889)
Affinity DataKi:  5.98E+3nM. Assay description: Displacement of FAM-Bid BH3 peptide from recombinant Mcl-1 (unknown origin) expressed in Escherichia coli BL21 after 10 mins by fluorescence polariza...
In DepthDetails ArticlePubMed
TargetApoptosis regulator Bcl-2(Homo sapiens (Human))
Dalian University Of Technology
Curated by ChEMBL
LigandPNGBDBM50441891(CHEMBL2436889)
Affinity DataKi:  9.28E+3nM. Assay description: Displacement of FAM-Bid BH3 peptide from recombinant Bcl-2 (unknown origin) expressed in Escherichia coli BL21 after 10 mins by fluorescence polariza...
In DepthDetails ArticlePubMed