BDBM50442125 CHEMBL2441107
SMILES COc1cccc(c1)C(=O)Nc1ccc(Oc2ccc(O)cc2)cc1
InChI Key InChIKey=CRULTPXBZBEKFC-UHFFFAOYSA-N
Data  2 IC50
  Tab Delimited (TSV)   2D SDfile   Computed 3D by Vconf -m prep SDfile
Find this compound or compounds like it in BindingDB:
Activity Spreadsheet -- Enzyme Inhibition Constant Data from BindingDB
Found 2 hits for monomerid = 50442125
TargetAndrogen receptor(Mus musculus)
Tokyo Medical And Dental University
Curated by ChEMBL
LigandPNGBDBM50442125(CHEMBL2441107)
Affinity DataIC50:  2.00E+3nM. Assay description: Antagonist activity at androgen receptor in mouse SC3 cells assessed as inhibition of DHT-induced cell growth after 3 days by CCK-8/WST-8 assay
In DepthDetails ArticlePubMed
TargetAndrogen receptor(Homo sapiens (Human))
Tokyo Medical And Dental University
Curated by ChEMBL
LigandPNGBDBM50442125(CHEMBL2441107)
Affinity DataIC50:  2.00E+4nM. Assay description: Displacement of [3H]-DHT from human GST-tagged androgen receptor LBD (627 to 919) expressed in Escherichia coli HB-101 after 15 hrs by liquid scintil...
In DepthDetails ArticlePubMed