BDBM50442160 CHEMBL2441279
SMILES CS(=O)(=O)N1CCOC(CNc2nc(Cc3ccccc3)cc(Nc3cc(n[nH]3)-c3ccco3)n2)C1
InChI Key InChIKey=AARZYPZTMIRNPN-UHFFFAOYSA-N
Data  2 KI
  Tab Delimited (TSV)   2D SDfile   Computed 3D by Vconf -m prep SDfile
Find this compound or compounds like it in BindingDB:
Activity Spreadsheet -- Enzyme Inhibition Constant Data from BindingDB
Found 2 hits for monomerid = 50442160
TargetTyrosine-protein kinase ITK/TSK(Homo sapiens (Human))
Glaxosmithkline
Curated by ChEMBL
LigandPNGBDBM50442160(CHEMBL2441279)
Affinity DataKi:  6.30nM. Assay description: Inhibition of ITK (unknown origin)
In DepthDetails ArticlePubMed
TargetAurora kinase B(Homo sapiens (Human))
Glaxosmithkline
Curated by ChEMBL
LigandPNGBDBM50442160(CHEMBL2441279)
Affinity DataKi:  316nM. Assay description: Inhibition of Aurora-B (unknown origin)
In DepthDetails ArticlePubMed