BDBM50442284 CHEMBL2442128
SMILES CC(Sc1cc(cnc1N)-c1cnn(C)c1)c1c(Cl)ccc(F)c1Cl
InChI Key InChIKey=SNOMKOLVUXTIMK-UHFFFAOYSA-N
Data  1 IC50
  Tab Delimited (TSV)   2D SDfile   Computed 3D by Vconf -m prep SDfile
Find this compound or compounds like it in BindingDB:
Activity Spreadsheet -- Enzyme Inhibition Constant Data from BindingDB
Found 1 hit for monomerid = 50442284
TargetHepatocyte growth factor receptor(Homo sapiens (Human))
Chinese Academy Of Sciences
Curated by ChEMBL
LigandPNGBDBM50442284(CHEMBL2442128)
Affinity DataIC50:  102nM. Assay description: Inhibition of c-Met (unknown origin) using poly (Glu, Tyr) 4:1 as substrate after 60 mins by ELISA
In DepthDetails ArticlePubMed