BDBM50442394 CHEMBL2442940
SMILES CN(C(=O)Cn1c2cc(ccc2oc1=O)-c1cccnc1)c1ccc(cc1)C(F)(F)F
InChI Key InChIKey=INPPXFAIFVJMMD-UHFFFAOYSA-N
Data  1 KI
  Tab Delimited (TSV)   2D SDfile   Computed 3D by Vconf -m prep SDfile
Find this compound or compounds like it in BindingDB:
Activity Spreadsheet -- Enzyme Inhibition Constant Data from BindingDB
Found 1 hit for monomerid = 50442394
TargetTranslocator protein(Homo sapiens (Human))
Dainippon Sumitomo Pharma
Curated by ChEMBL
LigandPNGBDBM50442394(CHEMBL2442940)
Affinity DataKi:  8nM. Assay description: Displacement of [3H]PK11195 from TSPO in human U-87 MG cells after 1 hr by by liquid scintillation counting analysis
In DepthDetails ArticlePubMed