BDBM50442486 CHEMBL2440381
SMILES CC(C)c1ccc(Cc2cc(ccc2Cl)[C@@H]2O[C@H]([C@H](O)CO)[C@H](O)[C@H]2O)cc1
InChI Key InChIKey=LGIZLBAUACBLCS-CSEOROSGSA-N
Data  2 EC50
  Tab Delimited (TSV)   2D SDfile   Computed 3D by Vconf -m prep SDfile
Find this compound or compounds like it in BindingDB:
Activity Spreadsheet -- Enzyme Inhibition Constant Data from BindingDB
Found 2 hits for monomerid = 50442486
TargetSodium/glucose cotransporter 2(Homo sapiens (Human))
National Taiwan University
Curated by ChEMBL
LigandPNGBDBM50442486(CHEMBL2440381)
Affinity DataEC50:  3.30E+4nM. Assay description: Inhibition of human SGLT2 expressed in CHO-K1 cells assessed as inhibition of [14C]-AMG uptake up to 120 mins by scintillation counting method
In DepthDetails ArticlePubMed
TargetSodium/glucose cotransporter 1(Homo sapiens (Human))
National Taiwan University
Curated by ChEMBL
LigandPNGBDBM50442486(CHEMBL2440381)
Affinity DataEC50:  4.70E+4nM. Assay description: Inhibition of human SGLT1 expressed in CHO-K1 cells assessed as inhibition of [14C]-AMG uptake up to 120 mins by scintillation counting method
In DepthDetails ArticlePubMed