BDBM50442534 CHEMBL2440896
SMILES CC(=O)[C@H]1CC[C@H]2[C@@H]3CCC4=CC(=O)CC[C@]4(C)[C@H]3[C@H](C[C@]12C)NC[C@@H](N)C(O)=O
InChI Key InChIKey=YVGKPKBONYGPMB-YKAMCSAESA-N
Data  1 EC50
  Tab Delimited (TSV)   2D SDfile   Computed 3D by Vconf -m prep SDfile
Find this compound or compounds like it in BindingDB:
Activity Spreadsheet -- Enzyme Inhibition Constant Data from BindingDB
Found 1 hit for monomerid = 50442534
TargetMineralocorticoid receptor(Homo sapiens (Human))
University Of Alberta
Curated by ChEMBL
LigandPNGBDBM50442534(CHEMBL2440896)
Affinity DataEC50:  4.10E+3nM. Assay description: Transactivation of human recombinant mineralocorticoid receptor expressed in HEK-293 cells after 24 hrs by luciferase reporter gene assay
In DepthDetails ArticlePubMed