BDBM50442712 CHEMBL2442508
SMILES OC(=O)c1cc2ccc(cc2oc1=O)N1CCOCC1
InChI Key InChIKey=KCTFUVGCNPZNQR-UHFFFAOYSA-N
Data  1 IC50
  Tab Delimited (TSV)   2D SDfile   Computed 3D by Vconf -m prep SDfile
Find this compound or compounds like it in BindingDB:
Activity Spreadsheet -- Enzyme Inhibition Constant Data from BindingDB
Found 1 hit for monomerid = 50442712
TargetMonocarboxylate transporter 4(Homo sapiens (Human))
Institut De Recherche Exp£Rimentale Et Clinique (Irec)
Curated by ChEMBL
LigandPNGBDBM50442712(CHEMBL2442508)
Affinity DataIC50:  7.90E+3nM. Assay description: Inhibition of MCT4-mediated [14C]-lactate uptake in human SiHa cells in lactate-containing medium assessed as remaining lactate concentration in cult...
In DepthDetails ArticlePubMed