BDBM50442947 CHEMBL3087185
SMILES COc1nn(C(C)c2ccc(Oc3ccccc3)cc2)c(=O)o1
InChI Key InChIKey=ZRNLKAYHCWFJNL-UHFFFAOYSA-N
Data  4 IC50
  Tab Delimited (TSV)   2D SDfile   Computed 3D by Vconf -m prep SDfile
Find this compound or compounds like it in BindingDB:
Activity Spreadsheet -- Enzyme Inhibition Constant Data from BindingDB
Found 4 hits for monomerid = 50442947
TargetMonoglyceride lipase(Homo sapiens (Human))
University Of Eastern Finland
Curated by ChEMBL
LigandPNGBDBM50442947(CHEMBL3087185)
Affinity DataIC50:  2.09E+3nM. Assay description: Inhibition of human recombinant MAGL overexpressed in HEK cells using 2-AG as substrate preincubated for 10 mins before substrate addition measured a...
In DepthDetails ArticlePubMed
TargetFatty-acid amide hydrolase 1(Homo sapiens (Human))
University Of Eastern Finland
Curated by ChEMBL
LigandPNGBDBM50442947(CHEMBL3087185)
Affinity DataIC50:  34nM. Assay description: Inhibition of human recombinant FAAH overexpressed in African green monkey COS7 cells using [3H]-anandamide as substrate preincubated for 10 mins bef...
In DepthDetails ArticlePubMed
TargetFatty-acid amide hydrolase 1(Homo sapiens (Human))
University Of Eastern Finland
Curated by ChEMBL
LigandPNGBDBM50442947(CHEMBL3087185)
Affinity DataIC50:  34nM. Assay description: Inhibition of human recombinant FAAH overexpressed in African green monkey COS7 cells using [3H]-anandamide as substrate preincubated for 10 mins bef...
In DepthDetails ArticlePubMed
TargetMonoglyceride lipase(Homo sapiens (Human))
University Of Eastern Finland
Curated by ChEMBL
LigandPNGBDBM50442947(CHEMBL3087185)
Affinity DataIC50:  2.00E+3nM. Assay description: Inhibition of human recombinant MAGL overexpressed in HEK cells using 2-AG as substrate preincubated for 10 mins before substrate addition measured a...
In DepthDetails ArticlePubMed